lampion votif
terme associe: T69-960
created: 2012-05-16T00:00:00+02:00
modified: 2014-11-26T16:18:05+01:00
status: 1
type: Concept
alternative label: lampe de dévotion
alternative label: veilleuse votive
broader: T69-1592
definition: Courte bougie, généralement dans un godet souvent de couleur rouge, bleue ou blanche. Posé sur un porte-cierges votif, il est allumé devant des images du Christ, de la Vierge, d'un saint ou devant des reliques comme signe tangible d'une prière ou comme ex-voto.
in scheme: T69
preferred label: votive lights @en-us
preferred label: lumino votivo @it
preferred label: lamparina votiva @pt
related: T69-960