marque à pain bénit
created: 2012-05-16T00:00:00+02:00
modified: 2014-11-26T16:20:27+01:00
status: 1
type: Concept
broad match: http://vocab.getty.edu/aat/300380004
broader: T69-1592
definition: Poinçon utilisé pour marquer une image religieuse sur les pains bénits que l'on distribuait aux fidèles pendant la messe, parfois aux membres d'une confrérie ou aux pauvres à l'occasion de cérémonies particulières.
in scheme: T69
preferred label: blessed bread presses @en-us
preferred label: stampo per pane benedetto @it
preferred label: marca de pão bento @pt