objet de dévotion encadré
terme associe: T69-1593
created: 2012-05-16T00:00:00+02:00
modified: 2014-11-26T16:30:30+01:00
status: 1
type: Concept
broad match: Dévotions catholiques
broad match: http://vocab.getty.edu/aat/300234144
broader: T69-1592
definition: Représentation d'un sujet religieux en deux dimensions ou en faible relief, placée dans un cadre et parfois décorée de papiers roulés.
in scheme: T69
preferred label: framed devotional objects @en-us
preferred label: oggetto devozionale incorniciato @it
preferred label: objecto devocional emoldurado @pt
related: T69-1593