oratoire domestique
terme associe: T69-3537
created: 2012-05-16T00:00:00+02:00
modified: 2014-11-26T16:37:01+01:00
status: 1
type: Concept
alternative label: autel domestique
broader: T69-1592
definition: Représentation d'un sujet religieux, utilisée pour la dévotion privée. Il s’agit souvent d'une boîte ouvrante vitrée ou d'une niche abritant un ou plusieurs personnages religieux ou une croix.
in scheme: T69
preferred label: domestic shrines @en-us
preferred label: oratorio domestico @it
preferred label: oratório doméstico @pt
related: T69-3537