panneau de dévotion
created: 2012-05-16T00:00:00+02:00
modified: 2014-11-26T16:41:35+01:00
status: 1
type: Concept
alternative label: tableau de dévotion
broader: T69-1592
definition: Plaque généralement encadrée, parfois décorée de motifs, représentations ou symboles religieux, portant une prière, une inscription signalant aux fidèles la présence d'un lieu ou d'un objet de dévotion.
in scheme: T69
preferred label: devotional panels @en-us
preferred label: targa devozionale @it
preferred label: painel devocional @pt