paradis
terme associe: T69-1439
created: 2012-05-16T00:00:00+02:00
modified: 2014-11-26T16:44:58+01:00
status: 1
type: Concept
alternative label: beatilho
broader: T69-1592
definition: Instrument de piété constitué d'une boîte vitrée contenant une scène religieuse, une crèche par exemple ou, plus rarement, une statuette.
in scheme: T69
preferred label: beatilhos @en-us
preferred label: scarabattolo @it
preferred label: maquineta @pt
related: T69-1439