costume de statue
created: 2012-05-16T00:00:00+02:00
modified: 2014-11-26T14:21:35+01:00
status: 1
type: Concept
broad match: http://vocab.getty.edu/aat/300047600
broader: T69-1595
definition: Vêtement confectionné pour habiller une statue particulièrement honorée d'un personnage sacré, en général une Vierge à l'Enfant.
in scheme: T69
preferred label: statue costumes @en-us
preferred label: paramenti di statua @it
preferred label: enxoval de imagen de vestir @pt