sceptre de statue
created: 2012-05-16T00:00:00+02:00
modified: 2014-11-26T14:32:09+01:00
status: 1
type: Concept
broader: T69-1595
definition: Sceptre réalisé en matériau plus ou moins précieux et porté par une statue, religieuse en général (Christ, Vierge) ou un saint qu'il contribue à caractériser.
in scheme: T69
preferred label: statue scepters @en-us
preferred label: scettro di statua @it
preferred label: ceptro de estátua @pt