buste-reliquaire
terme associe: T69-4829
created: 2012-05-16T00:00:00+02:00
modified: 2014-11-26T17:03:44+01:00
status: 1
type: Concept
broader: T69-1713
definition: Reliquaire en forme de buste contenant des reliques du personnage représenté. Il repose souvent sur un socle qui peut porter le nom du saint et contenir la relique.
in scheme: T69
preferred label: reliquary busts @en-us
preferred label: reliquiario a busto @it
preferred label: busto-relicário @pt
related: T69-4829