châsse
created: 2012-05-16T00:00:00+02:00
modified: 2014-11-26T17:10:57+01:00
status: 1
type: Concept
alternative label: châsse-reliquaire
alternative label: coffret-reliquaire
alternative label: reliquaire chapelle
broader: T69-1713
definition: Reliquaire en forme d'église, de coffre ou de cercueil, dans lequel est conservé une relique insigne ou parfois le squelette ou le corps entier d'un saint. Une châsse peut présenter une ou plusieurs parois entièrement ou partiellement transparentes pour permettre de voir les reliques.
in scheme: T69
preferred label: chasse reliquaries @en-us
preferred label: reliquiario a teca @it
preferred label: relicário de caixa @pt