croix-reliquaire
terme associe: T69-1145
terme associe: T69-1443
terme associe: T69-1645
terme associe: T69-1732
created: 2012-05-16T00:00:00+02:00
modified: 2014-11-26T17:14:54+01:00
status: 1
type: Concept
broader: T69-1713
definition: Reliquaire en forme de croix sur pied à simple ou double traverse.
in scheme: T69
preferred label: cross reliquaries @en-us
preferred label: reliquiario a croce @it
preferred label: cruz-relicário @pt
related: T69-1145
related: T69-1443
related: T69-1645
related: T69-1732