encolpion
terme associe: T69-2137
created: 2012-05-16T00:00:00+02:00
modified: 2014-11-26T17:17:44+01:00
status: 1
type: Concept
alternative label: encolpion cruciforme
alternative label: reliquaire-pend à col
broad match: http://data.bnf.fr/ark:/12148/cb119327497
broader: T69-1713
definition: Reliquaire porté au cou, en forme de médaillon, de pendentif, de flacon d'ampoule, ou de croix contenant de l'huile ayant touché un corps saint ou des reliques.
in scheme: T69
preferred label: enkolpia @en-us
preferred label: reliquiario a capsila @it
preferred label: encólpio @pt
related: T69-2137