groupe sculpté-reliquaire
created: 2012-05-16T00:00:00+02:00
modified: 2014-11-26T17:19:54+01:00
status: 1
type: Concept
broad match: http://data.bnf.fr/ark:/12148/cb119327497
broader: T69-1713
definition: Groupe sculpté contenant des reliques placées dans un ou plusieurs compartiments dans le corps des statues, la base ou dans un récipient porté par le groupe.
in scheme: T69
preferred label: sculptural group reliquaries @en-us
preferred label: reliquiario a gruppo scultoreo @it
preferred label: grupo escultórico relicário @pt