reliquaire-ostensoir
terme associe: T69-1261
created: 2012-05-16T00:00:00+02:00
modified: 2014-11-26T17:41:39+01:00
status: 1
type: Concept
alternative label: ostensoir-reliquaire
broader: T69-1713
definition: Reliquaire souvent à cylindre horizontal (reliquaire-monstrance), comprenant une partie ouvrante vitrée servant à exposer une grande hostie consacrée.
in scheme: T69
preferred label: monstrance-reliquaries @en-us
preferred label: reliquiario-ostensorio @it
preferred label: relicário com ostensório @pt
related: T69-1261