reliquaire de la Vraie Croix
terme associe: T69-1722
created: 2012-05-16T00:00:00+02:00
modified: 2014-11-26T17:23:04+01:00
status: 1
type: Concept
alternative label: croix-reliquaire de la Vraie Croix
alternative label: staurothèque
broad match: http://vocab.getty.edu/aat/300187549
broader: T69-1713
definition: Reliquaire contenant une relique de la Vraie Croix ayant généralement la forme d'une boîte plate et rectangulaire. Lorsqu’il prend la forme d’une croix, on parle de croix-reliquaire de la Vraie Croix.
in scheme: T69
preferred label: staurothèques @en-us
preferred label: stauroteca @it
preferred label: estauroteca @pt
related: T69-1722