reliquaire morphologique
terme associe: T69-4847
created: 2012-05-16T00:00:00+02:00
modified: 2014-11-26T17:30:48+01:00
status: 1
type: Concept
alternative label: cuisse-reliquaire
alternative label: côte-reliquaire
alternative label: doigt-reliquaire
alternative label: genou-reliquaire
alternative label: main-reliquaire
alternative label: pied-reliquaire
alternative label: reliquaire de crâne
broad match: http://data.bnf.fr/ark:/12148/cb119327497
broader: T69-1713
definition: Reliquaire représentant la partie du corps qui constitue la relique (chef-reliquaire, bras-reliquaire, doigt-reliquaire, etc.).
in scheme: T69
narrower: T69-1747
narrower: T69-1749
narrower: T69-6822
preferred label: body-part reliquaries @en-us
preferred label: reliquiario antropomorfo @it
preferred label: relicário antropomórfico @pt
related: T69-4847