statue-reliquaire
terme associe: T69-4837
created: 2012-05-16T00:00:00+02:00
modified: 2014-11-26T17:46:42+01:00
status: 1
type: Concept
broader: T69-1713
definition: Statue contenant des reliques placées dans une ou plusieurs logettes dans le corps, dans la base ou dans un récipient porté par la statue.
in scheme: T69
preferred label: statue-reliquaries @en-us
preferred label: reliquiario a statua @it
preferred label: estátua-relicário @pt
related: T69-4837