tableau-reliquaire
created: 2012-05-16T00:00:00+02:00
modified: 2014-11-26T17:50:30+01:00
status: 1
type: Concept
broad match: http://data.bnf.fr/ark:/12148/cb119327497
broad match: http://vocab.getty.edu/aat/300187549
broader: T69-1713
definition: Reliquaire en forme de tableau encadré, généralement suspendu et souvent décoré de papiers roulés souvent dorés.
in scheme: T69
preferred label: framed reliquaries @en-us
preferred label: reliquiario a tabella @it
preferred label: quadro-relicário @pt