relique
terme associe: T69-9449
created: 2012-05-16T00:00:00+02:00
modified: 2014-11-27T10:39:16+01:00
status: 1
type: Concept
broader: T69-1592
definition: Reste du corps d'un saint ou d'un martyr après sa mort, objet ayant été à son contact ou encore instrument de son supplice. Une relique est un objet sacré auquel on rend un culte.
in scheme: T69
preferred label: relics @en-us
related: T69-9449