rose d'or
created: 2012-05-16T00:00:00+02:00
modified: 2014-11-27T10:40:41+01:00
status: 1
type: Concept
broad match: http://vocab.getty.edu/aat/300234144
broader: T69-1592
definition: Objet précieux symbolique, offert chaque année par le pape à une église ou à une personnalité, pour l'honorer. La rose d'or se présente comme une branche de rosier, en or ou en argent doré, parfois montée sur un support. La fleur centrale comporte au sein de ses pétales une petite boîte contenant du saint Chrême et du baume parfumé.
in scheme: T69
preferred label: golden roses @en-us
preferred label: rosa d'oro @it
preferred label: rosa de ouro @pt