objet lié au pèlerinage
created: 2012-05-16T00:00:00+02:00
modified: 2014-11-28T13:04:06+01:00
status: 1
type: Concept
alternative label: insigne de pèlerinage
broader: T69-1114
definition: Objet, récipient, instrument à l’usage du pèlerin et l’accompagnant tout au long de son pèlerinage. Il peut être décoré d’inscriptions, de symboles ou de scènes religieuses.
in scheme: T69
narrower: T69-1768
narrower: T69-1772
narrower: T69-1775
narrower: T69-1784
preferred label: pilgrimage objects @en-us
preferred label: oggetti di pellegrinaggio @it
preferred label: objectos de peregrinação @pt