gourde de pèlerin
terme associe: T69-3934
created: 2012-05-16T00:00:00+02:00
modified: 2014-11-28T13:06:11+01:00
status: 1
type: Concept
broader: T69-1767
definition: Récipient utilisé par un pèlerin pour transporter la boisson, habituellement placé en haut de la hampe du bâton de pèlerin ou porté en bandoulière.
in scheme: T69
preferred label: pilgrim bottles @en-us
preferred label: fiasca di pellegrinaggio @it
preferred label: cabaça de peregrino @pt
related: T69-3934