insigne ecclésiastique
created: 2012-05-16T00:00:00+02:00
modified: 2014-11-26T12:37:59+01:00
status: 1
type: Concept
broader: T69-1114
definition: Attribut presque toujours réservé à un haut dignitaire ecclésiastique, souvent personnalisé de ses marques ou armoiries, qu’il utilise lors des célébrations religieuses.
in scheme: T69
narrower: T69-1818
narrower: T69-1833
narrower: T69-1834
narrower: T69-1838
narrower: T69-1851
narrower: T69-1853
narrower: T69-1856
narrower: T69-1862
narrower: T69-1865
preferred label: ecclesiastical insignias @en-us
preferred label: insegne ecclesiastiche @it
preferred label: insígnias eclesiásticas @pt