armoiries d'évêque
terme associe: T69-852
created: 2012-05-16T00:00:00+02:00
modified: 2014-11-26T12:41:38+01:00
status: 1
type: Concept
broader: T69-1817
definition: Armoiries d'un évêque peintes ou sculptées sur un support et placées, lors des cérémonies solennelles, sur son siège ou à proximité ou encore sur la porte d'une église.
in scheme: T69
preferred label: bishop's coat of arms @en-us
preferred label: arme episcopale @it
preferred label: armas episcopais @pt
related: T69-852