bâton pastoral
terme associe: T69-1575
terme associe: T69-2580
created: 2012-05-16T00:00:00+02:00
modified: 2014-11-26T13:54:31+01:00
status: 1
type: Concept
alternative label: croix papale
alternative label: croix pastorale
alternative label: férule
alternative label: tau
broader: T69-1817
definition: Bâton porté comme insigne de sa dignité par un haut dignitaire ecclésiastique, qui peut avoir la forme d’une crosse ou croix pastorale, d’une férule (en forme de sceptre, terminé par un pommeau surmonté d’une croix), ou d’un tau (en forme de T). La croix pastorale est portée devant le pape ou un archevêque. La croix papale a souvent trois traverses.
in scheme: T69
narrower: T69-1843
preferred label: pastoral staffs @en-us
preferred label: bastone pastorale @it
preferred label: bastão pastoral @pt
related: T69-1575
related: T69-2580