crosse pastorale
created: 2012-05-16T00:00:00+02:00
modified: 2014-11-26T14:01:50+01:00
status: 1
type: Concept
alternative label: crosse abbatiale
alternative label: crosse épiscopale
alternative label: crosseron
broader: T69-1838
definition: Bâton pastoral terminé par une volute appelée crosseron, souvent au-dessus d'un nœud, et porté par un dignitaire ecclésiastique.
in scheme: T69
preferred label: crosiers (episcopal) @en-us
preferred label: pastorale @it
preferred label: báculo pastoral @pt