croix pectorale
terme associe: T69-1645
terme associe: T69-1818
created: 2012-05-16T00:00:00+02:00
modified: 2014-11-26T14:05:21+01:00
status: 1
type: Concept
broader: T69-1817
definition: Insigne de dignité en forme de croix, suspendue autour du cou, portée par le clergé et autrefois par les fidèles, réservée depuis la Contre-Réforme aux hauts dignitaires ecclésiastiques. Généralement en métal précieux, elle peut être assortie à l’anneau pastoral.
in scheme: T69
preferred label: pectoral crosses @en-us
preferred label: croce pectorale @it
preferred label: cruz peitoral @pt
related: T69-1645
related: T69-1818