matrice de sceau ecclésiastique
terme associe: T69-1865
terme associe: T69-7813
created: 2012-05-16T00:00:00+02:00
modified: 2014-11-26T14:09:21+01:00
status: 1
type: Concept
alternative label: bague-sceau ecclésiastique
broader: T69-1817
definition: Matrice, généralement en métal, servant à imprimer un sceau ecclésiastique pouvant faire partie d'un anneau pastoral (bague-sceau ecclésiastique).
in scheme: T69
preferred label: ecclesiastical seal molds @en-us
preferred label: matrice di sigillo ecclesiastico @it
preferred label: matriz sigilar eclesiástica @pt
related: T69-1865
related: T69-7813