sceau ecclésiastique
terme associe: T69-1856
terme associe: T69-7812
created: 2012-05-16T00:00:00+02:00
modified: 2014-11-26T14:12:46+01:00
status: 1
type: Concept
broader: T69-1817
definition: Sceau utilisé, dans le cadre de ses fonctions, par un dignitaire ecclésiastique (ou son mandataire) et portant ses armoiries personnelles. On distingue les sceaux pendants, appelés bulles lorsqu’ils sont en métal (dotés d’un recto et d’un verso et maintenus au document par des fils ou rubans de papier) et les sceaux adhérents, essentiellement en cire.
in scheme: T69
preferred label: ecclesiastical seals @en-us
preferred label: sigillo ecclesiastico @it
preferred label: selo eclesiástico @pt
related: T69-1856
related: T69-7812