objet du culte protestant
created: 2012-05-16T00:00:00+02:00
modified: 2014-01-10T00:00:00+01:00
status: 1
type: Concept
broader: T69-1113
definition: Objet ou instrument lié à l’exercice ou à la pratique du culte protestant.
in scheme: T69
narrower: T69-1868
narrower: T69-1871
narrower: T69-1874
narrower: T69-1876
narrower: T69-1883
narrower: T69-1886
narrower: T69-1889
narrower: T69-1891
narrower: T69-1893
narrower: T69-1898