aiguière de baptême
terme associe: T69-3890
created: 2012-05-16T00:00:00+02:00
modified: 2014-01-10T00:00:00+01:00
status: 1
type: Concept
alternative label: fiole de baptême
broader: T69-1867
definition: Aiguière de petites dimensions (environ 15 cm de haut) destinée à contenir l'eau nécessaire pour le baptême.
in scheme: T69
related: T69-3890