aiguière de communion
terme associe: T69-3890
created: 2012-05-16T00:00:00+02:00
modified: 2014-01-10T00:00:00+01:00
status: 1
type: Concept
alternative label: gueux
broader: T69-1867
definition: Récipient en forme d'aiguière, généralement couvert et de grandes dimensions, destiné à contenir le vin nécessaire pour la communion.
in scheme: T69
related: T69-3890
scope note: La "channe bernoise" est l'appellation particulière d'une forme fréquente d'aiguière de communion en étain comportant une tige horizontale reliant le goulot latéral au haut du corps.