boîte pour le pain de la communion
created: 2012-05-16T00:00:00+02:00
modified: 2014-01-07T00:00:00+01:00
status: 1
type: Concept
alternative label: boîte à hosties luthérienne
alternative label: boîte à hosties protestante
broader: T69-1867
definition: Boîte à couvercle plat destinée à la conservation des hosties ou du pain utilisé dans le culte protestant.
in scheme: T69