patène protestante
created: 2012-05-16T00:00:00+02:00
modified: 2014-01-10T00:00:00+01:00
status: 1
type: Concept
broader: T69-1867
definition: Nom donné chez les luthériens au plat de communion ou plat de Cène sur lequel est présenté le pain de l'Eucharistie. On utilise dans le culte luthérien des hosties et non du pain pour la communion ; il peut s'agir alors d'une patène du culte catholique utilisée par les protestants.
in scheme: T69
scope note: Les objets servant à la communion forment un service de communion ou un service de sainte Cène : utiliser ce terme dans le champ PDEN.