chapiteau
created: 2012-05-16T00:00:00+02:00
modified: 2015-02-12T11:58:47+01:00
status: 1
type: Concept
broader: T69-186
definition: Elément formant transition entre le corps de la colonne, du pilier ou du pilastre, et sa charge. Le chapiteau est formé d'un corps (échine ou corbeille) et d'un couronnement (abaque et/ou tailloir). Dans l'architecture médiévale, l'astragale fait souvent partie du chapiteau.
in scheme: T69
preferred label: capitals (column components) @en-us