corne d'appel judaïque
created: 2012-05-16T00:00:00+02:00
modified: 2014-10-10T12:19:38+02:00
status: 1
type: Concept
alternative label: corne de bélier
alternative label: shofar
broad match: cb12124805x
broader: T69-5140
definition: Corne de bélier utilisée comme un cor dont l'officiant sonne durant la période de pénitence précédant le Jour de l'An, après les prières du matin et du soir, pour inciter les fidèles à l'examen de conscience et au repentir, et durant l'office du Jour de l'An pour clôturer la journée du Grand Pardon.
in scheme: T69
preferred label: shofars @en-us
scope note: Elle symbolise à la fois le bélier qui fut substitué à Isaac lors du sacrifice, la corne qui a retenti sur le Mont Sinaï et celle qui retentira au rassemblement des exilés.