boîte à aromates
created: 2012-05-16T00:00:00+02:00
modified: 2014-01-10T00:00:00+01:00
status: 1
type: Concept
alternative label: boîte à bessamin
alternative label: boîte à haddassim
broader: T69-1933
definition: Récipient en argent, généralement ajouré, souvent divisé en quatre compartiments et de formes très variées (architecturales ou animalières : oiseaux, poissons, ou végétales : fleurs, fruits, etc.) contenant des aromates (clous de girofle, poivre, fruits, fleurs) que l'assistance se passe et respire lors de la cérémonie de fin de Shabbat ou cérémonie de la séparation (Havdalah) à la synagogue et dans les maisons.
in scheme: T69