bougeoir pour la clôture du Shabbat
created: 2012-05-16T00:00:00+02:00
modified: 2014-01-10T00:00:00+01:00
status: 1
type: Concept
alternative label: bougeoir de Havdalah
alternative label: chandelier pour la clôture du Shabbat
broader: T69-1933
definition: Bougeoir dont le pied supporte quatre tiges verticales entre lesquelles on place la bougie tressée, allumée lors de la cérémonie de fin de Shabbat (Havdalah = séparation ou différenciation entre le temps sacré du Shabbat et le temps profane). Le pied peut comporter un tiroir pour les aromates.
in scheme: T69
scope note: Havdalah est la cérémonie qui clôture le Shabbat le samedi soir. Le bougeoir de Havdalah est parfois combiné avec la boîte à aromates : employer la double dénomination et indiquer fonctions combinées dans le champ STRU. Utiliser bougeoir de Havdalah dans le champ APPL.