luminaire de Shabbat
created: 2012-05-16T00:00:00+02:00
modified: 2014-01-10T00:00:00+01:00
status: 1
type: Concept
alternative label: chandelier de Shabbat
alternative label: lampe de Shabbat
broader: T69-1933
definition: Luminaire se présentant sous la forme soit d'un lustre, soit de plusieurs chandeliers ou bougeoirs allumés la veille du Shabbat au-dessus de la table par la maîtresse de maison pour l'inauguration du Shabbat. Les chandeliers et bougeoirs qui vont par paire comportent un nombre variable de bougies ; le lustre est généralement à huile, en forme d'étoile à nombre variable de branches, l'huile étant recueillie dans un petit récipient situé au-dessous.
in scheme: T69
scope note: Connus sous le nom d'étoiles de David, ces lustres ou lampes à suspension avaient une base en étoile pour recevoir l'huile et des mèches suspendues à une tige à balustres.