étui pour versets de la Torah
created: 2012-05-16T00:00:00+02:00
modified: 2014-01-10T00:00:00+01:00
status: 1
type: Concept
alternative label: mezouzah
alternative label: étui à mezouzah
broader: T69-1953
definition: Cylindre ou boîte oblongue en bois, cuir ou métal dans lequel on enferme le rouleau de parchemin sur lequel ont été calligraphiés les passages du Deutéronome ou Shem'a ; on le fixe au montant droit de la porte d'entrée de la maison et aussi aux portes des pièces d'habitation et de la synagogue.
in scheme: T69