fût
created: 2012-05-16T00:00:00+02:00
modified: 2015-02-12T12:37:59+01:00
status: 1
type: Concept
broader: T69-186
definition: Corps d'une colonne, généralement cylindrique.
in scheme: T69
preferred label: shafts (column components) @en-us