toupie de Hanouca
created: 2012-05-16T00:00:00+02:00
modified: 2014-01-10T00:00:00+01:00
status: 1
type: Concept
alternative label: dreidel
alternative label: toupie de Hanoukkah
alternative label: toupie de la reconsécration
broader: T69-1976
definition: Jouet consistant en une toupie en forme de dé à quatre faces sur lesquelles sont inscrites quatre lettres hébraïques (N., G., H., Sh., initiales des mots : nes gadol haya sham : un grand miracle s'est accompli ici) et une étoile de David ; on faisait usage de la sevivon (hébreu) ou des dreidlach (sing. dreidel, en yiddish) lors de cette fête.
in scheme: T69