coupe du prophète Elie
created: 2012-05-16T00:00:00+02:00
modified: 2014-01-10T00:00:00+01:00
status: 1
type: Concept
broader: T69-2011
definition: Coupe commémorative, symbole du retour du prophète Elie, placée sur la table du repas du Seder ; elle est plus grande que la coupe de Qiddoush et peut être munie d'un couvercle. Elle comporte un décor en relation avec Elie.
in scheme: T69