aiguière de circoncision
terme associe: T69-3890
created: 2012-05-16T00:00:00+02:00
modified: 2014-01-10T00:00:00+01:00
status: 1
type: Concept
broader: T69-2031
definition: Aiguière dans laquelle on conserve le vin qui sera versé dans la coupe de circoncision.
in scheme: T69
related: T69-3890