nécessaire de circoncision
created: 2012-05-16T00:00:00+02:00
modified: 2014-01-10T00:00:00+01:00
status: 1
type: Concept
broader: T69-2031
definition: Ensemble composé d'une pince pour maintenir le prépuce, d'un couteau et/ou d'une paire de ciseaux et d'un ou deux flacons à astringent, utilisés par le circonciseur (mohèl).
in scheme: T69
narrower: T69-2040
narrower: T69-2041
narrower: T69-2043
narrower: T69-2045
scope note: La circoncision se pratique huit jours après la naissance et marque l'entrée de tout mâle juif dans l'alliance entre Dieu et Israël.