socle d'architecture
terme associe: T69-4876
created: 2012-05-16T00:00:00+02:00
modified: 2015-02-20T16:33:16+01:00
status: 1
type: Concept
broader: T69-186
definition: Massif surélevant un support, un groupe de supports jumelés.
in scheme: T69
preferred label: socles @en-us
related: T69-4876