contrat de mariage
created: 2012-05-16T00:00:00+02:00
modified: 2014-01-10T00:00:00+01:00
status: 1
type: Concept
alternative label: acte de mariage
alternative label: ketoubbah
broader: T69-2050
definition: Document rappelant les obligations financières du mari à l'égard de sa femme. Rédigé sur papier ou sur parchemin, on le trouve généralement encadré et enluminé.
in scheme: T69