support anthropomorphe
terme associe: T69-4837
created: 2012-05-16T00:00:00+02:00
modified: 2015-02-20T16:59:45+01:00
status: 1
type: Concept
alternative label: atlante
alternative label: canéphore
alternative label: cariatide
broad match: cb11977661v
broader: T69-186
definition: Statue de forme humaine servant de support vertical.
in scheme: T69
preferred label: anthropomorphic supporting elements @en-us
related: T69-4837