coupe de société de sépulture
created: 2012-05-16T00:00:00+02:00
modified: 2014-01-10T00:00:00+01:00
status: 1
type: Concept
alternative label: coupe de confrérie d'enterrement
alternative label: coupe de hevra qaddisha
broader: T69-2061
definition: Coupe, chope ou gobelet portant l'inscription du nom de la société de sépulture et dans lequel on boit du vin lors du banquet annuel de la société de sépulture (hevra qaddisha), qui se tient le jour de l'anniversaire de la mort de Moïse.
in scheme: T69
scope note: Ces sociétés de sépulture sont des émanations de la communauté religieuse, et ont pour rôle principal d'aider les proches et d'exercer toutes les fonctions nécessaires au déroulement des funérailles.