objet du culte orthodoxe
created: 2012-05-16T00:00:00+02:00
modified: 2014-01-10T00:00:00+01:00
status: 1
type: Concept
broader: T69-1113
definition: Objet ou instrument lié à l’exercice ou à la pratique du culte orthodoxe.
in scheme: T69
narrower: T69-2104
narrower: T69-2107
narrower: T69-2109
narrower: T69-2111
narrower: T69-2113
narrower: T69-2117
narrower: T69-2121
narrower: T69-2123
narrower: T69-2125
narrower: T69-2126
narrower: T69-2127
narrower: T69-2130
narrower: T69-2133
narrower: T69-2137
narrower: T69-2140
narrower: T69-2145
narrower: T69-2147
narrower: T69-2150
narrower: T69-2152
narrower: T69-2154
narrower: T69-2158
narrower: T69-2159
narrower: T69-9085